{"text_format":"1","workbook":"xlsx","n_sheets":12,"sheets":["Calculator","Base Case","Scenario","Output","Calculator Instructions","Shock Analysis - RW Multiplier","Shock Analysis Support","Shock Analysis Support 2","Shock Analysis - RW %","Shock Analysis Instructions","All_Inputs","Definitions"],"not_rendered":{"charts":0,"images":5,"macros":1,"external_links":0,"defined_names":10,"comments":2,"pivot_tables":0},"unopened":[],"bounds":{"document_bytes":16777216,"sheet_cells":100000,"rows_first":2000,"rows_last":500,"rows_between":2000,"halvings":0,"cell_chars":16384,"cell_head_chars":4096},"cells_cut":0,"cells_raw":0,"read":"whole","date_system":"1900"}

{"sheet":"Calculator","index":0,"n_rows":60,"n_cols":11,"rows_kept":60,"cut":false,"hidden":false,"merged":[]}
[]
[]
[]
[]
[]
[null,"BASEL III SSFA Calculator for the FHLB MPF Program"]
[]
[null,"Enable Macros before using the Calculator"]
[]
[]
{"$rows_left_out":51}
{"sheet":"Base Case","index":1,"n_rows":48,"n_cols":16,"rows_kept":48,"cut":false,"hidden":true,"merged":[[12,5,13,12],[15,5,16,12],[19,5,20,12],[22,5,23,12]]}
[]
[]
[null,"MPF Product",null,null,null,null,null,null,null,null,null,null,null,null,null,"Original"]
[null,null,null,null,null,null,null,null,null,null,null,null,null,null,null,"day 1"]
[null,"KG",null,null,"weighted average capital requirement",null,null,null,null,null,null,null,null,"inpt","KG",{"$f":"Output!I13","v":4.0250000000000001E-2}]
[]
[null,"KA = (1 - W) * KG + (0.5 * W)",null,null,"W is ratio of delinquent to total balance (90 days or more past due)",null,null,null,null,null,null,null,null,"inpt","W",{"$f":"Output!I15","v":6.2500000000000003E-3}]
[null,null,null,null,null,"is 0 at start and might grow over time",null,null,null,null,null,null,null,null,"KA",{"$f":"(1-P7)*P5+(0.5*P7)","v":4.3123437500000007E-2}]
[null,null,null,null,null,"KA = KG on day 1"]
[null,"CE Obligation Amount",null,null,null,null,null,null,null,null,null,null,null,null,null,{"$f":"Output!I17","v":0.05}]
{"$rows_left_out":39}
{"sheet":"Scenario","index":2,"n_rows":44,"n_cols":16,"rows_kept":44,"cut":false,"hidden":true,"merged":[[12,5,13,12],[15,5,16,12],[19,5,20,12],[22,5,23,12]]}
[]
[]
[null,"MPF Product",null,null,null,null,null,null,null,null,null,null,null,null,null,"Original"]
[null,null,null,null,null,null,null,null,null,null,null,null,null,null,null,"day 1"]
[null,"KG",null,null,"weighted average capital requirement",null,null,null,null,null,null,null,null,"inpt","KG",{"$f":"Calculator!$K$27","v":0}]
[]
[null,"KA = (1 - W) * KG + (0.5 * W)",null,null,"W is ratio of delinquent to total balance (90 days or more past due)",null,null,null,null,null,null,null,null,"inpt","W",{"$f":"Calculator!$K$29","v":0}]
[null,null,null,null,null,"is 0 at start and might grow over time",null,null,null,null,null,null,null,null,"KA",{"$f":"(1-P7)*P5+(0.5*P7)","v":0}]
[null,null,null,null,null,"KA = KG on day 1"]
[null,"CE Obligation Amount",null,null,null,null,null,null,null,null,null,null,null,null,null,{"$f":"Calculator!$K$31","v":0}]
{"$rows_left_out":35}
{"sheet":"Output","index":3,"n_rows":147,"n_cols":29,"rows_kept":147,"cut":false,"hidden":false,"merged":[[42,3,42,28],[66,3,66,28],[93,1,112,1],[117,1,136,1],[91,3,91,28],[115,3,115,28],[44,1,63,1],[68,1,87,1]]}
[]
[]
[]
[]
[]
[null,"BASEL III SSFA Calculator for the FHLB MPF Program"]
[]
[]
[]
[]
{"$rows_left_out":138}
{"sheet":"Calculator Instructions","index":4,"n_rows":65,"n_cols":2,"rows_kept":65,"cut":false,"hidden":false,"merged":[]}
[]
[]
[]
[]
[]
[null,"SSFA Calculator Instructions"]
[]
[null,"1) Enable Macros before using the Calculator"]
[]
[null,"2) Input the following information for each master commitment in the base case inputs section on the Calculator tab:"]
{"$rows_left_out":56}
{"sheet":"Shock Analysis - RW Multiplier","index":5,"n_rows":74,"n_cols":31,"rows_kept":74,"cut":false,"hidden":false,"merged":[[42,5,42,30],[45,2,64,2],[17,5,17,30],[20,2,39,2]]}
[]
[]
[]
[]
[]
[null,null,"BASEL III Risk Weight Multiplier Shock Analysis"]
[]
[]
[null,null,null,null,null,null,null,null,null,null,null,null,{"$f":"Output!I13","v":4.0250000000000001E-2}]
[null,null,null,null,null,null,null,null,null,null,null,null,{"$f":"Output!I15","v":6.2500000000000003E-3}]
{"$rows_left_out":65}
{"sheet":"Shock Analysis Support","index":6,"n_rows":46,"n_cols":41,"rows_kept":46,"cut":false,"hidden":true,"merged":[[12,5,13,12],[15,5,16,12],[19,5,20,12],[22,5,23,12]]}
[{"$f":"'Shock Analysis - RW Multiplier'!$A$16","v":1}]
[]
[null,"MPF Product",null,null,null,null,null,null,null,null,null,null,null,null,null,"Original","Original","Original","Original","Original","Original","Original","Original","Original","Original","Original","Original","Original","Original","Original","Original","Original","Original","Original","Original","Original","Original","Original","Original","Original","Original"]
[null,null,null,null,null,null,null,null,null,null,null,null,null,null,null,"day 1","day 1","day 1","day 1","day 1","day 1","day 1","day 1","day 1","day 1","day 1","day 1","day 1","day 1","day 1","day 1","day 1","day 1","day 1","day 1","day 1","day 1","day 1","day 1","day 1","day 1"]
[null,"KG",null,null,"weighted average capital requirement",null,null,null,null,null,null,null,null,"inpt","KG",{"$f":"'Shock Analysis - RW Multiplier'!$M$9","v":4.0250000000000001E-2},{"$f":"'Shock Analysis - RW Multiplier'!$M$9","v":4.0250000000000001E-2},{"$f":"'Shock Analysis - RW Multiplier'!$M$9","v":4.0250000000000001E-2},{"$f":"'Shock Analysis - RW Multiplier'!$M$9","v":4.0250000000000001E-2},{"$f":"'Shock Analysis - RW Multiplier'!$M$9","v":4.0250000000000001E-2},{"$f":"'Shock Analysis - RW Multiplier'!$M$9","v":4.0250000000000001E-2},{"$f":"'Shock Analysis - RW Multiplier'!$M$9","v":4.0250000000000001E-2},{"$f":"'Shock Analysis - RW Multiplier'!$M$9","v":4.0250000000000001E-2},{"$f":"'Shock Analysis - RW Multiplier'!$M$9","v":4.0250000000000001E-2},{"$f":"'Shock Analysis - RW Multiplier'!$M$9","v":4.0250000000000001E-2},{"$f":"'Shock Analysis - RW Multiplier'!$M$9","v":4.0250000000000001E-2},{"$f":"'Shock Analysis - RW Multiplier'!$M$9","v":4.0250000000000001E-2},{"$f":"'Shock Analysis - RW Multiplier'!$M$9","v":4.0250000000000001E-2},{"$f":"'Shock Analysis - RW Multiplier'!$M$9","v":4.0250000000000001E-2},{"$f":"'Shock Analysis - RW Multiplier'!$M$9","v":4.0250000000000001E-2},{"$f":"'Shock Analysis - RW Multiplier'!$M$9","v":4.0250000000000001E-2},{"$f":"'Shock Analysis - RW Multiplier'!$M$9","v":4.0250000000000001E-2},{"$f":"'Shock Analysis - RW Multiplier'!$M$9","v":4.0250000000000001E-2},{"$f":"'Shock Analysis - RW Multiplier'!$M$9","v":4.0250000000000001E-2},{"$f":"'Shock Analysis - RW Multiplier'!$M$9","v":4.0250000000000001E-2},{"$f":"'Shock Analysis - RW Multiplier'!$M$9","v":4.0250000000000001E-2},{"$f":"'Shock Analysis - RW Multiplier'!$M$9","v":4.0250000000000001E-2},{"$f":"'Shock Analysis - RW Multiplier'!$M$9","v":4.0250000000000001E-2},{"$f":"'Shock Analysis - RW Multiplier'!$M$9","v":4.0250000000000001E-2},{"$f":"'Shock Analysis - RW Multiplier'!$M$9","v":4.0250000000000001E-2},{"$f":"'Shock Analysis - RW Multiplier'!$M$9","v":4.0250000000000001E-2}]
[]
[null,"KA = (1 - W) * KG + (0.5 * W)",null,null,"W is ratio of delinquent to total balance (90 days or more past due)",null,null,null,null,null,null,null,null,"inpt","W",{"$f":"'Shock Analysis - RW Multiplier'!$M$10","v":6.2500000000000003E-3},{"$f":"'Shock Analysis - RW Multiplier'!$M$10","v":6.2500000000000003E-3},{"$f":"'Shock Analysis - RW Multiplier'!$M$10","v":6.2500000000000003E-3},{"$f":"'Shock Analysis - RW Multiplier'!$M$10","v":6.2500000000000003E-3},{"$f":"'Shock Analysis - RW Multiplier'!$M$10","v":6.2500000000000003E-3},{"$f":"'Shock Analysis - RW Multiplier'!$M$10","v":6.2500000000000003E-3},{"$f":"'Shock Analysis - RW Multiplier'!$M$10","v":6.2500000000000003E-3},{"$f":"'Shock Analysis - RW Multiplier'!$M$10","v":6.2500000000000003E-3},{"$f":"'Shock Analysis - RW Multiplier'!$M$10","v":6.2500000000000003E-3},{"$f":"'Shock Analysis - RW Multiplier'!$M$10","v":6.2500000000000003E-3},{"$f":"'Shock Analysis - RW Multiplier'!$M$10","v":6.2500000000000003E-3},{"$f":"'Shock Analysis - RW Multiplier'!$M$10","v":6.2500000000000003E-3},{"$f":"'Shock Analysis - RW Multiplier'!$M$10","v":6.2500000000000003E-3},{"$f":"'Shock Analysis - RW Multiplier'!$M$10","v":6.2500000000000003E-3},{"$f":"'Shock Analysis - RW Multiplier'!$M$10","v":6.2500000000000003E-3},{"$f":"'Shock Analysis - RW Multiplier'!$M$10","v":6.2500000000000003E-3},{"$f":"'Shock Analysis - RW Multiplier'!$M$10","v":6.2500000000000003E-3},{"$f":"'Shock Analysis - RW Multiplier'!$M$10","v":6.2500000000000003E-3},{"$f":"'Shock Analysis - RW Multiplier'!$M$10","v":6.2500000000000003E-3},{"$f":"'Shock Analysis - RW Multiplier'!$M$10","v":6.2500000000000003E-3},{"$f":"'Shock Analysis - RW Multiplier'!$M$10","v":6.2500000000000003E-3},{"$f":"'Shock Analysis - RW Multiplier'!$M$10","v":6.2500000000000003E-3},{"$f":"'Shock Analysis - RW Multiplier'!$M$10","v":6.2500000000000003E-3},{"$f":"'Shock Analysis - RW Multiplier'!$M$10","v":6.2500000000000003E-3},{"$f":"'Shock Analysis - RW Multiplier'!$M$10","v":6.2500000000000003E-3},{"$f":"'Shock Analysis - RW Multiplier'!$M$10","v":6.2500000000000003E-3}]
[null,null,null,null,null,"is 0 at start and might grow over time",null,null,null,null,null,null,null,null,"KA",{"$f":"(1-P7)*P5+(0.5*P7)","v":4.3123437500000007E-2},{"$f":"(1-Q7)*Q5+(0.5*Q7)","v":4.3123437500000007E-2},{"$f":"(1-R7)*R5+(0.5*R7)","v":4.3123437500000007E-2},4.3123437500000007E-2,4.3123437500000007E-2,4.3123437500000007E-2,4.3123437500000007E-2,4.3123437500000007E-2,4.3123437500000007E-2,4.3123437500000007E-2,4.3123437500000007E-2,4.3123437500000007E-2,4.3123437500000007E-2,4.3123437500000007E-2,4.3123437500000007E-2,4.3123437500000007E-2,4.3123437500000007E-2,4.3123437500000007E-2,4.3123437500000007E-2,4.3123437500000007E-2,4.3123437500000007E-2,{"$f":"(1-AK7)*AK5+(0.5*AK7)","v":4.3123437500000007E-2},{"$f":"(1-AL7)*AL5+(0.5*AL7)","v":4.3123437500000007E-2},{"$f":"(1-AM7)*AM5+(0.5*AM7)","v":4.3123437500000007E-2},{"$f":"(1-AN7)*AN5+(0.5*AN7)","v":4.3123437500000007E-2},{"$f":"(1-AO7)*AO5+(0.5*AO7)","v":4.3123437500000007E-2}]
[null,null,null,null,null,"KA = KG on day 1"]
[null,"CE Obligation Amount",null,null,null,null,null,null,null,null,null,null,null,null,null,{"$f":"VLOOKUP($A$1,'Shock Analysis - RW Multiplier'!$A$46:$D$65,4,FALSE)","v":0.02},{"$f":"VLOOKUP($A$1,'Shock Analysis - RW Multiplier'!$A$46:$D$65,4,FALSE)","v":0.02},{"$f":"VLOOKUP($A$1,'Shock Analysis - RW Multiplier'!$A$46:$D$65,4,FALSE)","v":0.02},{"$f":"VLOOKUP($A$1,'Shock Analysis - RW Multiplier'!$A$46:$D$65,4,FALSE)","v":0.02},{"$f":"VLOOKUP($A$1,'Shock Analysis - RW Multiplier'!$A$46:$D$65,4,FALSE)","v":0.02},{"$f":"VLOOKUP($A$1,'Shock Analysis - RW Multiplier'!$A$46:$D$65,4,FALSE)","v":0.02},{"$f":"VLOOKUP($A$1,'Shock Analysis - RW Multiplier'!$A$46:$D$65,4,FALSE)","v":0.02},{"$f":"VLOOKUP($A$1,'Shock Analysis - RW Multiplier'!$A$46:$D$65,4,FALSE)","v":0.02},{"$f":"VLOOKUP($A$1,'Shock Analysis - RW Multiplier'!$A$46:$D$65,4,FALSE)","v":0.02},{"$f":"VLOOKUP($A$1,'Shock Analysis - RW Multiplier'!$A$46:$D$65,4,FALSE)","v":0.02},{"$f":"VLOOKUP($A$1,'Shock Analysis - RW Multiplier'!$A$46:$D$65,4,FALSE)","v":0.02},{"$f":"VLOOKUP($A$1,'Shock Analysis - RW Multiplier'!$A$46:$D$65,4,FALSE)","v":0.02},{"$f":"VLOOKUP($A$1,'Shock Analysis - RW Multiplier'!$A$46:$D$65,4,FALSE)","v":0.02},{"$f":"VLOOKUP($A$1,'Shock Analysis - RW Multiplier'!$A$46:$D$65,4,FALSE)","v":0.02},{"$f":"VLOOKUP($A$1,'Shock Analysis - RW Multiplier'!$A$46:$D$65,4,FALSE)","v":0.02},{"$f":"VLOOKUP($A$1,'Shock Analysis - RW Multiplier'!$A$46:$D$65,4,FALSE)","v":0.02},{"$f":"VLOOKUP($A$1,'Shock Analysis - RW Multiplier'!$A$46:$D$65,4,FALSE)","v":0.02},{"$f":"VLOOKUP($A$1,'Shock Analysis - RW Multiplier'!$A$46:$D$65,4,FALSE)","v":0.02},{"$f":"VLOOKUP($A$1,'Shock Analysis - RW Multiplier'!$A$46:$D$65,4,FALSE)","v":0.02},{"$f":"VLOOKUP($A$1,'Shock Analysis - RW Multiplier'!$A$46:$D$65,4,FALSE)","v":0.02},{"$f":"VLOOKUP($A$1,'Shock Analysis - RW Multiplier'!$A$46:$D$65,4,FALSE)","v":0.02},{"$f":"VLOOKUP($A$1,'Shock Analysis - RW Multiplier'!$A$46:$D$65,4,FALSE)","v":0.02},{"$f":"VLOOKUP($A$1,'Shock Analysis - RW Multiplier'!$A$46:$D$65,4,FALSE)","v":0.02},{"$f":"VLOOKUP($A$1,'Shock Analysis - RW Multiplier'!$A$46:$D$65,4,FALSE)","v":0.02},{"$f":"VLOOKUP($A$1,'Shock Analysis - RW Multiplier'!$A$46:$D$65,4,FALSE)","v":0.02},{"$f":"VLOOKUP($A$1,'Shock Analysis - RW Multiplier'!$A$46:$D$65,4,FALSE)","v":0.02}]
{"$rows_left_out":37}
{"sheet":"Shock Analysis Support 2","index":7,"n_rows":46,"n_cols":41,"rows_kept":46,"cut":false,"hidden":true,"merged":[[12,5,13,12],[15,5,16,12],[19,5,20,12],[22,5,23,12]]}
[{"$f":"'Shock Analysis - RW Multiplier'!$A$16","v":1}]
[]
[null,"MPF Product",null,null,null,null,null,null,null,null,null,null,null,null,null,"Original","Original","Original","Original","Original","Original","Original","Original","Original","Original","Original","Original","Original","Original","Original","Original","Original","Original","Original","Original","Original","Original","Original","Original","Original","Original"]
[null,null,null,null,null,null,null,null,null,null,null,null,null,null,null,"day 1","day 1","day 1","day 1","day 1","day 1","day 1","day 1","day 1","day 1","day 1","day 1","day 1","day 1","day 1","day 1","day 1","day 1","day 1","day 1","day 1","day 1","day 1","day 1","day 1","day 1"]
[null,"KG",null,null,"weighted average capital requirement",null,null,null,null,null,null,null,null,"inpt","KG",{"$f":"'Shock Analysis - RW Multiplier'!$M$9","v":4.0250000000000001E-2},{"$f":"'Shock Analysis - RW Multiplier'!$M$9","v":4.0250000000000001E-2},{"$f":"'Shock Analysis - RW Multiplier'!$M$9","v":4.0250000000000001E-2},{"$f":"'Shock Analysis - RW Multiplier'!$M$9","v":4.0250000000000001E-2},{"$f":"'Shock Analysis - RW Multiplier'!$M$9","v":4.0250000000000001E-2},{"$f":"'Shock Analysis - RW Multiplier'!$M$9","v":4.0250000000000001E-2},{"$f":"'Shock Analysis - RW Multiplier'!$M$9","v":4.0250000000000001E-2},{"$f":"'Shock Analysis - RW Multiplier'!$M$9","v":4.0250000000000001E-2},{"$f":"'Shock Analysis - RW Multiplier'!$M$9","v":4.0250000000000001E-2},{"$f":"'Shock Analysis - RW Multiplier'!$M$9","v":4.0250000000000001E-2},{"$f":"'Shock Analysis - RW Multiplier'!$M$9","v":4.0250000000000001E-2},{"$f":"'Shock Analysis - RW Multiplier'!$M$9","v":4.0250000000000001E-2},{"$f":"'Shock Analysis - RW Multiplier'!$M$9","v":4.0250000000000001E-2},{"$f":"'Shock Analysis - RW Multiplier'!$M$9","v":4.0250000000000001E-2},{"$f":"'Shock Analysis - RW Multiplier'!$M$9","v":4.0250000000000001E-2},{"$f":"'Shock Analysis - RW Multiplier'!$M$9","v":4.0250000000000001E-2},{"$f":"'Shock Analysis - RW Multiplier'!$M$9","v":4.0250000000000001E-2},{"$f":"'Shock Analysis - RW Multiplier'!$M$9","v":4.0250000000000001E-2},{"$f":"'Shock Analysis - RW Multiplier'!$M$9","v":4.0250000000000001E-2},{"$f":"'Shock Analysis - RW Multiplier'!$M$9","v":4.0250000000000001E-2},{"$f":"'Shock Analysis - RW Multiplier'!$M$9","v":4.0250000000000001E-2},{"$f":"'Shock Analysis - RW Multiplier'!$M$9","v":4.0250000000000001E-2},{"$f":"'Shock Analysis - RW Multiplier'!$M$9","v":4.0250000000000001E-2},{"$f":"'Shock Analysis - RW Multiplier'!$M$9","v":4.0250000000000001E-2},{"$f":"'Shock Analysis - RW Multiplier'!$M$9","v":4.0250000000000001E-2},{"$f":"'Shock Analysis - RW Multiplier'!$M$9","v":4.0250000000000001E-2}]
[]
[null,"KA = (1 - W) * KG + (0.5 * W)",null,null,"W is ratio of delinquent to total balance (90 days or more past due)",null,null,null,null,null,null,null,null,"inpt","W",{"$f":"'Shock Analysis - RW Multiplier'!$M$10","v":6.2500000000000003E-3},{"$f":"'Shock Analysis - RW Multiplier'!$M$10","v":6.2500000000000003E-3},{"$f":"'Shock Analysis - RW Multiplier'!$M$10","v":6.2500000000000003E-3},{"$f":"'Shock Analysis - RW Multiplier'!$M$10","v":6.2500000000000003E-3},{"$f":"'Shock Analysis - RW Multiplier'!$M$10","v":6.2500000000000003E-3},{"$f":"'Shock Analysis - RW Multiplier'!$M$10","v":6.2500000000000003E-3},{"$f":"'Shock Analysis - RW Multiplier'!$M$10","v":6.2500000000000003E-3},{"$f":"'Shock Analysis - RW Multiplier'!$M$10","v":6.2500000000000003E-3},{"$f":"'Shock Analysis - RW Multiplier'!$M$10","v":6.2500000000000003E-3},{"$f":"'Shock Analysis - RW Multiplier'!$M$10","v":6.2500000000000003E-3},{"$f":"'Shock Analysis - RW Multiplier'!$M$10","v":6.2500000000000003E-3},{"$f":"'Shock Analysis - RW Multiplier'!$M$10","v":6.2500000000000003E-3},{"$f":"'Shock Analysis - RW Multiplier'!$M$10","v":6.2500000000000003E-3},{"$f":"'Shock Analysis - RW Multiplier'!$M$10","v":6.2500000000000003E-3},{"$f":"'Shock Analysis - RW Multiplier'!$M$10","v":6.2500000000000003E-3},{"$f":"'Shock Analysis - RW Multiplier'!$M$10","v":6.2500000000000003E-3},{"$f":"'Shock Analysis - RW Multiplier'!$M$10","v":6.2500000000000003E-3},{"$f":"'Shock Analysis - RW Multiplier'!$M$10","v":6.2500000000000003E-3},{"$f":"'Shock Analysis - RW Multiplier'!$M$10","v":6.2500000000000003E-3},{"$f":"'Shock Analysis - RW Multiplier'!$M$10","v":6.2500000000000003E-3},{"$f":"'Shock Analysis - RW Multiplier'!$M$10","v":6.2500000000000003E-3},{"$f":"'Shock Analysis - RW Multiplier'!$M$10","v":6.2500000000000003E-3},{"$f":"'Shock Analysis - RW Multiplier'!$M$10","v":6.2500000000000003E-3},{"$f":"'Shock Analysis - RW Multiplier'!$M$10","v":6.2500000000000003E-3},{"$f":"'Shock Analysis - RW Multiplier'!$M$10","v":6.2500000000000003E-3},{"$f":"'Shock Analysis - RW Multiplier'!$M$10","v":6.2500000000000003E-3}]
[null,null,null,null,null,"is 0 at start and might grow over time",null,null,null,null,null,null,null,null,"KA",{"$f":"(1-P7)*P5+(0.5*P7)","v":4.3123437500000007E-2},{"$f":"(1-Q7)*Q5+(0.5*Q7)","v":4.3123437500000007E-2},{"$f":"(1-R7)*R5+(0.5*R7)","v":4.3123437500000007E-2},4.3123437500000007E-2,4.3123437500000007E-2,4.3123437500000007E-2,4.3123437500000007E-2,4.3123437500000007E-2,4.3123437500000007E-2,4.3123437500000007E-2,4.3123437500000007E-2,4.3123437500000007E-2,4.3123437500000007E-2,4.3123437500000007E-2,4.3123437500000007E-2,4.3123437500000007E-2,4.3123437500000007E-2,4.3123437500000007E-2,4.3123437500000007E-2,4.3123437500000007E-2,4.3123437500000007E-2,4.3123437500000007E-2,4.3123437500000007E-2,4.3123437500000007E-2,4.3123437500000007E-2,4.3123437500000007E-2]
[null,null,null,null,null,"KA = KG on day 1"]
[null,"CE Obligation Amount",null,null,null,null,null,null,null,null,null,null,null,null,null,{"$f":"VLOOKUP($A$1,'Shock Analysis - RW Multiplier'!$A$46:$D$65,4,FALSE)","v":0.02},{"$f":"VLOOKUP($A$1,'Shock Analysis - RW Multiplier'!$A$46:$D$65,4,FALSE)","v":0.02},{"$f":"VLOOKUP($A$1,'Shock Analysis - RW Multiplier'!$A$46:$D$65,4,FALSE)","v":0.02},{"$f":"VLOOKUP($A$1,'Shock Analysis - RW Multiplier'!$A$46:$D$65,4,FALSE)","v":0.02},{"$f":"VLOOKUP($A$1,'Shock Analysis - RW Multiplier'!$A$46:$D$65,4,FALSE)","v":0.02},{"$f":"VLOOKUP($A$1,'Shock Analysis - RW Multiplier'!$A$46:$D$65,4,FALSE)","v":0.02},{"$f":"VLOOKUP($A$1,'Shock Analysis - RW Multiplier'!$A$46:$D$65,4,FALSE)","v":0.02},{"$f":"VLOOKUP($A$1,'Shock Analysis - RW Multiplier'!$A$46:$D$65,4,FALSE)","v":0.02},{"$f":"VLOOKUP($A$1,'Shock Analysis - RW Multiplier'!$A$46:$D$65,4,FALSE)","v":0.02},{"$f":"VLOOKUP($A$1,'Shock Analysis - RW Multiplier'!$A$46:$D$65,4,FALSE)","v":0.02},{"$f":"VLOOKUP($A$1,'Shock Analysis - RW Multiplier'!$A$46:$D$65,4,FALSE)","v":0.02},{"$f":"VLOOKUP($A$1,'Shock Analysis - RW Multiplier'!$A$46:$D$65,4,FALSE)","v":0.02},{"$f":"VLOOKUP($A$1,'Shock Analysis - RW Multiplier'!$A$46:$D$65,4,FALSE)","v":0.02},{"$f":"VLOOKUP($A$1,'Shock Analysis - RW Multiplier'!$A$46:$D$65,4,FALSE)","v":0.02},{"$f":"VLOOKUP($A$1,'Shock Analysis - RW Multiplier'!$A$46:$D$65,4,FALSE)","v":0.02},{"$f":"VLOOKUP($A$1,'Shock Analysis - RW Multiplier'!$A$46:$D$65,4,FALSE)","v":0.02},{"$f":"VLOOKUP($A$1,'Shock Analysis - RW Multiplier'!$A$46:$D$65,4,FALSE)","v":0.02},{"$f":"VLOOKUP($A$1,'Shock Analysis - RW Multiplier'!$A$46:$D$65,4,FALSE)","v":0.02},{"$f":"VLOOKUP($A$1,'Shock Analysis - RW Multiplier'!$A$46:$D$65,4,FALSE)","v":0.02},{"$f":"VLOOKUP($A$1,'Shock Analysis - RW Multiplier'!$A$46:$D$65,4,FALSE)","v":0.02},{"$f":"VLOOKUP($A$1,'Shock Analysis - RW Multiplier'!$A$46:$D$65,4,FALSE)","v":0.02},{"$f":"VLOOKUP($A$1,'Shock Analysis - RW Multiplier'!$A$46:$D$65,4,FALSE)","v":0.02},{"$f":"VLOOKUP($A$1,'Shock Analysis - RW Multiplier'!$A$46:$D$65,4,FALSE)","v":0.02},{"$f":"VLOOKUP($A$1,'Shock Analysis - RW Multiplier'!$A$46:$D$65,4,FALSE)","v":0.02},{"$f":"VLOOKUP($A$1,'Shock Analysis - RW Multiplier'!$A$46:$D$65,4,FALSE)","v":0.02},{"$f":"VLOOKUP($A$1,'Shock Analysis - RW Multiplier'!$A$46:$D$65,4,FALSE)","v":0.02}]
{"$rows_left_out":37}
{"sheet":"Shock Analysis - RW %","index":8,"n_rows":74,"n_cols":31,"rows_kept":74,"cut":false,"hidden":false,"merged":[[17,5,17,30],[20,2,39,2],[42,5,42,30],[45,2,64,2]]}
[]
[]
[]
[]
[]
[null,null,"BASEL III Risk Weight % Shock Analysis"]
[]
[]
[null,null,null,null,null,null,null,null,null,null,null,null,{"$f":"'Shock Analysis - RW Multiplier'!$M$9","v":4.0250000000000001E-2}]
[null,null,null,null,null,null,null,null,null,null,null,null,{"$f":"'Shock Analysis - RW Multiplier'!$M$10","v":6.2500000000000003E-3}]
{"$rows_left_out":65}
{"sheet":"Shock Analysis Instructions","index":9,"n_rows":49,"n_cols":2,"rows_kept":49,"cut":false,"hidden":true,"merged":[]}
[]
[]
[]
[]
[]
[null,"SSFA Shock Analysis Instructions"]
[]
[null,"1) Enable Macros before using the Shock Analysis Tool"]
[]
[null,"2) The shock analysis tool illustrates the Risk Weight Multipliers (Shock Analysis - RW Multiplier tab) and Percentages (Shock Analysis - RW% tab)"]
{"$rows_left_out":40}
{"sheet":"All_Inputs","index":10,"n_rows":35,"n_cols":12,"rows_kept":35,"cut":false,"hidden":false,"merged":[]}
[]
[]
[]
[]
[]
[null,"BASEL III SSFA Inputs",null,null,null,null,null,null,null,null,null,"Scenario"]
[]
[]
[null,"Weighted Average Capital Requirement (KG) (%):",null,null,null,null,null,null,null,{"$f":"'Base Case'!$P$5","v":4.0250000000000001E-2},null,{"$f":"Scenario!$P$5","v":0}]
[]
{"$rows_left_out":26}
{"sheet":"Definitions","index":11,"n_rows":84,"n_cols":4,"rows_kept":84,"cut":false,"hidden":false,"merged":[[44,12,45,19],[47,12,50,19]]}
[]
[]
[]
[]
[]
[null,"Base Case Inputs"]
[]
[null,null,"Loans Sold and Outstanding"]
[null,null,"Total loans sold and outstanding should be input by dollar amount per the pooled detail report."]
[null,null,null,"   ($26,117,643 in example)"]
{"$rows_left_out":74}